{"text_format":"1","workbook":"xlsx","n_sheets":5,"sheets":["Summary-TBC BY SCHOOL","Data Validation","Example","FOR FINANCE USE ONLY","UploadFile"],"not_rendered":{"charts":0,"images":0,"macros":1,"external_links":0,"defined_names":0,"comments":1,"pivot_tables":0},"unopened":[],"bounds":{"document_bytes":16777216,"sheet_cells":100000,"rows_first":2000,"rows_last":500,"rows_between":2000,"halvings":0,"cell_chars":16384,"cell_head_chars":4096},"cells_cut":0,"cells_raw":0,"read":"whole","date_system":"1900"}

{"sheet":"Summary-TBC BY SCHOOL","index":0,"n_rows":156,"n_cols":12,"rows_kept":156,"cut":false,"hidden":false,"merged":[[2,0,3,0],[8,11,8,15],[2,2,3,2],[5,11,5,14],[4,1,4,4],[2,6,3,6],[2,1,3,1],[2,3,3,3],[2,4,3,4],[2,5,3,5]]}
[null,"* Fill in the blank fields highlighted in blue"]
[]
["Term","Sponsor ID","Sponsor Name","Student ID","Student Name","Amount Owed","Sponsored Amount","Sponsor type ","Payment Amount ",null,null,"SCHOLARSHIP/SPONSORSHIP BULK PAYMENT TEMPLATE"]
[null,null,null,null,null,null,null,"Internal "]
[null,"TOTAL",null,null,null,{"$f":"SUM(F6:F153)","v":0},{"$f":"SUM(G6:G153)","v":0},{"$f":"SUM(H6:H153)","v":0},{"$f":"SUM(I6:I153)","v":0},null,null,"* Complete one summary spreadsheet for each sponsor (i.e. 2 sponsors = 2 spreadsheet)."]
[null,null,null,null,null,null,null,"Internal",{"$f":"IF(H6=\"Internal\",G6,0)","v":0},null,null,"* One spreadsheet can only contain max 150 payments. If you have more than 150 payments, please split it into multiple files. "]
[null,null,null,null,null,null,null,"Internal",{"$f":"IF(H7=\"Internal\",G7,0)","v":0}]
[null,null,null,null,null,null,null,"Internal",0]
[null,null,null,null,null,null,null,"Internal",0,null,null,"From 6/10/2021 : all EXTERNAL Sponsorship invoices will be issued in Banner \n=> this template is no longer used for external sponsorship payment. "]
[null,null,null,null,null,null,null,"Internal",0]
[null,null,null,null,null,null,null,"Internal",0]
[null,null,null,null,null,null,null,"Internal",0]
[null,null,null,null,null,null,null,"Internal",0]
[null,null,null,null,null,null,null,"Internal",0]
[null,null,null,null,null,null,null,"Internal",0]
[null,null,null,null,null,null,null,"Internal",0]
[null,null,null,null,null,null,null,"Internal",0]
[null,null,null,null,null,null,null,"Internal",0]
[null,null,null,null,null,null,null,"Internal",0]
[null,null,null,null,null,null,null,"Internal",0]
{"$rows_left_out":137}
{"sheet":"Data Validation","index":1,"n_rows":2,"n_cols":2,"rows_kept":2,"cut":false,"hidden":true,"merged":[]}
[]
[null,"Internal"]

{"sheet":"Example","index":2,"n_rows":9,"n_cols":9,"rows_kept":9,"cut":false,"hidden":false,"merged":[[1,1,2,1],[1,0,2,0],[1,4,2,4],[1,7,1,8],[1,5,2,5],[1,6,2,6],[1,3,2,3],[1,2,2,2]]}
[]
["Sponsor Code","Person ID","First Name","Last Name ","Amount Owed","Sponsored Amount","Sponsored Type ","To be paid by "]
[null,null,null,null,null,null,null,"External Sponsor","Internal Sponsor"]
[]
["SPEXAMPLE",11111111,"John ","Smith",15720,15720,"Internal ",{"$f":"F5","v":15720},{"$f":"F5*$I$4","v":0}]
["SPEXAMPLE",22222222,"Jess ","Simpson",11790,11790,"Internal ",{"$f":"F6","v":11790},{"$f":"F6*$I$4","v":0}]
[null,null,null,null,{"$f":"SUM(E5:E6)","v":27510},"Total ",null,{"$f":"SUM(H5:H6)","v":27510},{"$f":"SUM(I5:I6)","v":0}]
[]
["* Fill in the blank fields highlighted in blue colour."]

{"sheet":"FOR FINANCE USE ONLY","index":3,"n_rows":151,"n_cols":11,"rows_kept":151,"cut":false,"hidden":false,"merged":[]}
["Service Name","Student Number","First Name","Last Name","Effective Date","Amount","TXRef","Email",null,"TOTAL Receipt ",{"$f":"COUNT(F2:F151)","v":0}]
[{"$f":"IF(AND(ISBLANK('Summary-TBC BY SCHOOL'!$B6),ISBLANK('Summary-TBC BY SCHOOL'!$D6)),\"\",\"SCH Fees\")","v":""},{"$f":"IF(AND(ISBLANK('Summary-TBC BY SCHOOL'!$D6),ISBLANK('Summary-TBC BY SCHOOL'!$B6)),\"\",IF(ISBLANK('Summary-TBC BY SCHOOL'!$B6),'Summary-TBC BY SCHOOL'!$D6,'Summary-TBC BY SCHOOL'!$B6))","v":""},{"$f":"IF(ISBLANK('Summary-TBC BY SCHOOL'!$C6),\"\",'Summary-TBC BY SCHOOL'!C6)","v":""},{"$f":"IF(AND(ISBLANK('Summary-TBC BY SCHOOL'!$B6),ISBLANK('Summary-TBC BY SCHOOL'!$D6)),\"\",'Summary-TBC BY SCHOOL'!E6)","v":""},{"$f":"IF(ISBLANK($B2),\"\",IF((LEN(DAY(NOW())))=1,(\"0\"&DAY(NOW())),DAY(NOW()))&\"/\"&IF((LEN(MONTH(NOW())))=1,(\"0\"&MONTH(NOW())),MONTH(NOW()))&\"/\"&YEAR(NOW()))","v":"11/07/2022"},{"$f":"IFERROR(IF(AND(ISBLANK('Summary-TBC BY SCHOOL'!$D6),ISBLANK('Summary-TBC BY SCHOOL'!$B6)),\"\",'Summary-TBC BY SCHOOL'!$I6*100),\"\")","v":""},{"$f":"IF(ISBLANK('Summary-TBC BY SCHOOL'!$A6),\"\",'Summary-TBC BY SCHOOL'!$A6)","v":""}]
[{"$f":"IF(AND(ISBLANK('Summary-TBC BY SCHOOL'!$B7),ISBLANK('Summary-TBC BY SCHOOL'!$D7)),\"\",\"SCH Fees\")","v":""},{"$f":"IF(AND(ISBLANK('Summary-TBC BY SCHOOL'!$D7),ISBLANK('Summary-TBC BY SCHOOL'!$B7)),\"\",IF(ISBLANK('Summary-TBC BY SCHOOL'!$B7),'Summary-TBC BY SCHOOL'!$D7,'Summary-TBC BY SCHOOL'!$B7))","v":""},{"$f":"IF(ISBLANK('Summary-TBC BY SCHOOL'!$C7),\"\",'Summary-TBC BY SCHOOL'!C7)","v":""},{"$f":"IF(AND(ISBLANK('Summary-TBC BY SCHOOL'!$B7),ISBLANK('Summary-TBC BY SCHOOL'!$D7)),\"\",'Summary-TBC BY SCHOOL'!E7)","v":""},{"$f":"IF(ISBLANK($B3),\"\",IF((LEN(DAY(NOW())))=1,(\"0\"&DAY(NOW())),DAY(NOW()))&\"/\"&IF((LEN(MONTH(NOW())))=1,(\"0\"&MONTH(NOW())),MONTH(NOW()))&\"/\"&YEAR(NOW()))","v":"11/07/2022"},{"$f":"IFERROR(IF(AND(ISBLANK('Summary-TBC BY SCHOOL'!$D7),ISBLANK('Summary-TBC BY SCHOOL'!$B7)),\"\",'Summary-TBC BY SCHOOL'!$I7*100),\"\")","v":""},{"$f":"IF(ISBLANK('Summary-TBC BY SCHOOL'!$A7),\"\",'Summary-TBC BY SCHOOL'!$A7)","v":""},null,null,"TOTAL Amount ",{"$f":"SUM(F2:F151)","v":0}]
[{"$f":"IF(AND(ISBLANK('Summary-TBC BY SCHOOL'!$B8),ISBLANK('Summary-TBC BY SCHOOL'!$D8)),\"\",\"SCH Fees\")","v":""},{"$f":"IF(AND(ISBLANK('Summary-TBC BY SCHOOL'!$D8),ISBLANK('Summary-TBC BY SCHOOL'!$B8)),\"\",IF(ISBLANK('Summary-TBC BY SCHOOL'!$B8),'Summary-TBC BY SCHOOL'!$D8,'Summary-TBC BY SCHOOL'!$B8))","v":""},{"$f":"IF(ISBLANK('Summary-TBC BY SCHOOL'!$C8),\"\",'Summary-TBC BY SCHOOL'!C8)","v":""},{"$f":"IF(AND(ISBLANK('Summary-TBC BY SCHOOL'!$B8),ISBLANK('Summary-TBC BY SCHOOL'!$D8)),\"\",'Summary-TBC BY SCHOOL'!E8)","v":""},"11/07/2022",{"$f":"IFERROR(IF(AND(ISBLANK('Summary-TBC BY SCHOOL'!$D8),ISBLANK('Summary-TBC BY SCHOOL'!$B8)),\"\",'Summary-TBC BY SCHOOL'!$I8*100),\"\")","v":""},{"$f":"IF(ISBLANK('Summary-TBC BY SCHOOL'!$A8),\"\",'Summary-TBC BY SCHOOL'!$A8)","v":""}]
[{"$f":"IF(AND(ISBLANK('Summary-TBC BY SCHOOL'!$B9),ISBLANK('Summary-TBC BY SCHOOL'!$D9)),\"\",\"SCH Fees\")","v":""},{"$f":"IF(AND(ISBLANK('Summary-TBC BY SCHOOL'!$D9),ISBLANK('Summary-TBC BY SCHOOL'!$B9)),\"\",IF(ISBLANK('Summary-TBC BY SCHOOL'!$B9),'Summary-TBC BY SCHOOL'!$D9,'Summary-TBC BY SCHOOL'!$B9))","v":""},{"$f":"IF(ISBLANK('Summary-TBC BY SCHOOL'!$C9),\"\",'Summary-TBC BY SCHOOL'!C9)","v":""},{"$f":"IF(AND(ISBLANK('Summary-TBC BY SCHOOL'!$B9),ISBLANK('Summary-TBC BY SCHOOL'!$D9)),\"\",'Summary-TBC BY SCHOOL'!E9)","v":""},"11/07/2022",{"$f":"IFERROR(IF(AND(ISBLANK('Summary-TBC BY SCHOOL'!$D9),ISBLANK('Summary-TBC BY SCHOOL'!$B9)),\"\",'Summary-TBC BY SCHOOL'!$I9*100),\"\")","v":""},{"$f":"IF(ISBLANK('Summary-TBC BY SCHOOL'!$A9),\"\",'Summary-TBC BY SCHOOL'!$A9)","v":""}]
[{"$f":"IF(AND(ISBLANK('Summary-TBC BY SCHOOL'!$B10),ISBLANK('Summary-TBC BY SCHOOL'!$D10)),\"\",\"SCH Fees\")","v":""},{"$f":"IF(AND(ISBLANK('Summary-TBC BY SCHOOL'!$D10),ISBLANK('Summary-TBC BY SCHOOL'!$B10)),\"\",IF(ISBLANK('Summary-TBC BY SCHOOL'!$B10),'Summary-TBC BY SCHOOL'!$D10,'Summary-TBC BY SCHOOL'!$B10))","v":""},{"$f":"IF(ISBLANK('Summary-TBC BY SCHOOL'!$C10),\"\",'Summary-TBC BY SCHOOL'!C10)","v":""},{"$f":"IF(AND(ISBLANK('Summary-TBC BY SCHOOL'!$B10),ISBLANK('Summary-TBC BY SCHOOL'!$D10)),\"\",'Summary-TBC BY SCHOOL'!E10)","v":""},"11/07/2022",{"$f":"IFERROR(IF(AND(ISBLANK('Summary-TBC BY SCHOOL'!$D10),ISBLANK('Summary-TBC BY SCHOOL'!$B10)),\"\",'Summary-TBC BY SCHOOL'!$I10*100),\"\")","v":""},{"$f":"IF(ISBLANK('Summary-TBC BY SCHOOL'!$A10),\"\",'Summary-TBC BY SCHOOL'!$A10)","v":""}]
[{"$f":"IF(AND(ISBLANK('Summary-TBC BY SCHOOL'!$B11),ISBLANK('Summary-TBC BY SCHOOL'!$D11)),\"\",\"SCH Fees\")","v":""},{"$f":"IF(AND(ISBLANK('Summary-TBC BY SCHOOL'!$D11),ISBLANK('Summary-TBC BY SCHOOL'!$B11)),\"\",IF(ISBLANK('Summary-TBC BY SCHOOL'!$B11),'Summary-TBC BY SCHOOL'!$D11,'Summary-TBC BY SCHOOL'!$B11))","v":""},{"$f":"IF(ISBLANK('Summary-TBC BY SCHOOL'!$C11),\"\",'Summary-TBC BY SCHOOL'!C11)","v":""},{"$f":"IF(AND(ISBLANK('Summary-TBC BY SCHOOL'!$B11),ISBLANK('Summary-TBC BY SCHOOL'!$D11)),\"\",'Summary-TBC BY SCHOOL'!E11)","v":""},"11/07/2022",{"$f":"IFERROR(IF(AND(ISBLANK('Summary-TBC BY SCHOOL'!$D11),ISBLANK('Summary-TBC BY SCHOOL'!$B11)),\"\",'Summary-TBC BY SCHOOL'!$I11*100),\"\")","v":""},{"$f":"IF(ISBLANK('Summary-TBC BY SCHOOL'!$A11),\"\",'Summary-TBC BY SCHOOL'!$A11)","v":""}]
[{"$f":"IF(AND(ISBLANK('Summary-TBC BY SCHOOL'!$B12),ISBLANK('Summary-TBC BY SCHOOL'!$D12)),\"\",\"SCH Fees\")","v":""},{"$f":"IF(AND(ISBLANK('Summary-TBC BY SCHOOL'!$D12),ISBLANK('Summary-TBC BY SCHOOL'!$B12)),\"\",IF(ISBLANK('Summary-TBC BY SCHOOL'!$B12),'Summary-TBC BY SCHOOL'!$D12,'Summary-TBC BY SCHOOL'!$B12))","v":""},{"$f":"IF(ISBLANK('Summary-TBC BY SCHOOL'!$C12),\"\",'Summary-TBC BY SCHOOL'!C12)","v":""},{"$f":"IF(AND(ISBLANK('Summary-TBC BY SCHOOL'!$B12),ISBLANK('Summary-TBC BY SCHOOL'!$D12)),\"\",'Summary-TBC BY SCHOOL'!E12)","v":""},"11/07/2022",{"$f":"IFERROR(IF(AND(ISBLANK('Summary-TBC BY SCHOOL'!$D12),ISBLANK('Summary-TBC BY SCHOOL'!$B12)),\"\",'Summary-TBC BY SCHOOL'!$I12*100),\"\")","v":""},{"$f":"IF(ISBLANK('Summary-TBC BY SCHOOL'!$A12),\"\",'Summary-TBC BY SCHOOL'!$A12)","v":""}]
[{"$f":"IF(AND(ISBLANK('Summary-TBC BY SCHOOL'!$B13),ISBLANK('Summary-TBC BY SCHOOL'!$D13)),\"\",\"SCH Fees\")","v":""},{"$f":"IF(AND(ISBLANK('Summary-TBC BY SCHOOL'!$D13),ISBLANK('Summary-TBC BY SCHOOL'!$B13)),\"\",IF(ISBLANK('Summary-TBC BY SCHOOL'!$B13),'Summary-TBC BY SCHOOL'!$D13,'Summary-TBC BY SCHOOL'!$B13))","v":""},{"$f":"IF(ISBLANK('Summary-TBC BY SCHOOL'!$C13),\"\",'Summary-TBC BY SCHOOL'!C13)","v":""},{"$f":"IF(AND(ISBLANK('Summary-TBC BY SCHOOL'!$B13),ISBLANK('Summary-TBC BY SCHOOL'!$D13)),\"\",'Summary-TBC BY SCHOOL'!E13)","v":""},"11/07/2022",{"$f":"IFERROR(IF(AND(ISBLANK('Summary-TBC BY SCHOOL'!$D13),ISBLANK('Summary-TBC BY SCHOOL'!$B13)),\"\",'Summary-TBC BY SCHOOL'!$I13*100),\"\")","v":""},{"$f":"IF(ISBLANK('Summary-TBC BY SCHOOL'!$A13),\"\",'Summary-TBC BY SCHOOL'!$A13)","v":""}]
[{"$f":"IF(AND(ISBLANK('Summary-TBC BY SCHOOL'!$B14),ISBLANK('Summary-TBC BY SCHOOL'!$D14)),\"\",\"SCH Fees\")","v":""},{"$f":"IF(AND(ISBLANK('Summary-TBC BY SCHOOL'!$D14),ISBLANK('Summary-TBC BY SCHOOL'!$B14)),\"\",IF(ISBLANK('Summary-TBC BY SCHOOL'!$B14),'Summary-TBC BY SCHOOL'!$D14,'Summary-TBC BY SCHOOL'!$B14))","v":""},{"$f":"IF(ISBLANK('Summary-TBC BY SCHOOL'!$C14),\"\",'Summary-TBC BY SCHOOL'!C14)","v":""},{"$f":"IF(AND(ISBLANK('Summary-TBC BY SCHOOL'!$B14),ISBLANK('Summary-TBC BY SCHOOL'!$D14)),\"\",'Summary-TBC BY SCHOOL'!E14)","v":""},"11/07/2022",{"$f":"IFERROR(IF(AND(ISBLANK('Summary-TBC BY SCHOOL'!$D14),ISBLANK('Summary-TBC BY SCHOOL'!$B14)),\"\",'Summary-TBC BY SCHOOL'!$I14*100),\"\")","v":""},{"$f":"IF(ISBLANK('Summary-TBC BY SCHOOL'!$A14),\"\",'Summary-TBC BY SCHOOL'!$A14)","v":""}]
[{"$f":"IF(AND(ISBLANK('Summary-TBC BY SCHOOL'!$B15),ISBLANK('Summary-TBC BY SCHOOL'!$D15)),\"\",\"SCH Fees\")","v":""},{"$f":"IF(AND(ISBLANK('Summary-TBC BY SCHOOL'!$D15),ISBLANK('Summary-TBC BY SCHOOL'!$B15)),\"\",IF(ISBLANK('Summary-TBC BY SCHOOL'!$B15),'Summary-TBC BY SCHOOL'!$D15,'Summary-TBC BY SCHOOL'!$B15))","v":""},{"$f":"IF(ISBLANK('Summary-TBC BY SCHOOL'!$C15),\"\",'Summary-TBC BY SCHOOL'!C15)","v":""},{"$f":"IF(AND(ISBLANK('Summary-TBC BY SCHOOL'!$B15),ISBLANK('Summary-TBC BY SCHOOL'!$D15)),\"\",'Summary-TBC BY SCHOOL'!E15)","v":""},"11/07/2022",{"$f":"IFERROR(IF(AND(ISBLANK('Summary-TBC BY SCHOOL'!$D15),ISBLANK('Summary-TBC BY SCHOOL'!$B15)),\"\",'Summary-TBC BY SCHOOL'!$I15*100),\"\")","v":""},{"$f":"IF(ISBLANK('Summary-TBC BY SCHOOL'!$A15),\"\",'Summary-TBC BY SCHOOL'!$A15)","v":""}]
[{"$f":"IF(AND(ISBLANK('Summary-TBC BY SCHOOL'!$B16),ISBLANK('Summary-TBC BY SCHOOL'!$D16)),\"\",\"SCH Fees\")","v":""},{"$f":"IF(AND(ISBLANK('Summary-TBC BY SCHOOL'!$D16),ISBLANK('Summary-TBC BY SCHOOL'!$B16)),\"\",IF(ISBLANK('Summary-TBC BY SCHOOL'!$B16),'Summary-TBC BY SCHOOL'!$D16,'Summary-TBC BY SCHOOL'!$B16))","v":""},{"$f":"IF(ISBLANK('Summary-TBC BY SCHOOL'!$C16),\"\",'Summary-TBC BY SCHOOL'!C16)","v":""},{"$f":"IF(AND(ISBLANK('Summary-TBC BY SCHOOL'!$B16),ISBLANK('Summary-TBC BY SCHOOL'!$D16)),\"\",'Summary-TBC BY SCHOOL'!E16)","v":""},"11/07/2022",{"$f":"IFERROR(IF(AND(ISBLANK('Summary-TBC BY SCHOOL'!$D16),ISBLANK('Summary-TBC BY SCHOOL'!$B16)),\"\",'Summary-TBC BY SCHOOL'!$I16*100),\"\")","v":""},{"$f":"IF(ISBLANK('Summary-TBC BY SCHOOL'!$A16),\"\",'Summary-TBC BY SCHOOL'!$A16)","v":""}]
[{"$f":"IF(AND(ISBLANK('Summary-TBC BY SCHOOL'!$B17),ISBLANK('Summary-TBC BY SCHOOL'!$D17)),\"\",\"SCH Fees\")","v":""},{"$f":"IF(AND(ISBLANK('Summary-TBC BY SCHOOL'!$D17),ISBLANK('Summary-TBC BY SCHOOL'!$B17)),\"\",IF(ISBLANK('Summary-TBC BY SCHOOL'!$B17),'Summary-TBC BY SCHOOL'!$D17,'Summary-TBC BY SCHOOL'!$B17))","v":""},{"$f":"IF(ISBLANK('Summary-TBC BY SCHOOL'!$C17),\"\",'Summary-TBC BY SCHOOL'!C17)","v":""},{"$f":"IF(AND(ISBLANK('Summary-TBC BY SCHOOL'!$B17),ISBLANK('Summary-TBC BY SCHOOL'!$D17)),\"\",'Summary-TBC BY SCHOOL'!E17)","v":""},"11/07/2022",{"$f":"IFERROR(IF(AND(ISBLANK('Summary-TBC BY SCHOOL'!$D17),ISBLANK('Summary-TBC BY SCHOOL'!$B17)),\"\",'Summary-TBC BY SCHOOL'!$I17*100),\"\")","v":""},{"$f":"IF(ISBLANK('Summary-TBC BY SCHOOL'!$A17),\"\",'Summary-TBC BY SCHOOL'!$A17)","v":""}]
[{"$f":"IF(AND(ISBLANK('Summary-TBC BY SCHOOL'!$B18),ISBLANK('Summary-TBC BY SCHOOL'!$D18)),\"\",\"SCH Fees\")","v":""},{"$f":"IF(AND(ISBLANK('Summary-TBC BY SCHOOL'!$D18),ISBLANK('Summary-TBC BY SCHOOL'!$B18)),\"\",IF(ISBLANK('Summary-TBC BY SCHOOL'!$B18),'Summary-TBC BY SCHOOL'!$D18,'Summary-TBC BY SCHOOL'!$B18))","v":""},{"$f":"IF(ISBLANK('Summary-TBC BY SCHOOL'!$C18),\"\",'Summary-TBC BY SCHOOL'!C18)","v":""},{"$f":"IF(AND(ISBLANK('Summary-TBC BY SCHOOL'!$B18),ISBLANK('Summary-TBC BY SCHOOL'!$D18)),\"\",'Summary-TBC BY SCHOOL'!E18)","v":""},"11/07/2022",{"$f":"IFERROR(IF(AND(ISBLANK('Summary-TBC BY SCHOOL'!$D18),ISBLANK('Summary-TBC BY SCHOOL'!$B18)),\"\",'Summary-TBC BY SCHOOL'!$I18*100),\"\")","v":""},{"$f":"IF(ISBLANK('Summary-TBC BY SCHOOL'!$A18),\"\",'Summary-TBC BY SCHOOL'!$A18)","v":""}]
[{"$f":"IF(AND(ISBLANK('Summary-TBC BY SCHOOL'!$B19),ISBLANK('Summary-TBC BY SCHOOL'!$D19)),\"\",\"SCH Fees\")","v":""},{"$f":"IF(AND(ISBLANK('Summary-TBC BY SCHOOL'!$D19),ISBLANK('Summary-TBC BY SCHOOL'!$B19)),\"\",IF(ISBLANK('Summary-TBC BY SCHOOL'!$B19),'Summary-TBC BY SCHOOL'!$D19,'Summary-TBC BY SCHOOL'!$B19))","v":""},{"$f":"IF(ISBLANK('Summary-TBC BY SCHOOL'!$C19),\"\",'Summary-TBC BY SCHOOL'!C19)","v":""},{"$f":"IF(AND(ISBLANK('Summary-TBC BY SCHOOL'!$B19),ISBLANK('Summary-TBC BY SCHOOL'!$D19)),\"\",'Summary-TBC BY SCHOOL'!E19)","v":""},"11/07/2022",{"$f":"IFERROR(IF(AND(ISBLANK('Summary-TBC BY SCHOOL'!$D19),ISBLANK('Summary-TBC BY SCHOOL'!$B19)),\"\",'Summary-TBC BY SCHOOL'!$I19*100),\"\")","v":""},{"$f":"IF(ISBLANK('Summary-TBC BY SCHOOL'!$A19),\"\",'Summary-TBC BY SCHOOL'!$A19)","v":""}]
[{"$f":"IF(AND(ISBLANK('Summary-TBC BY SCHOOL'!$B20),ISBLANK('Summary-TBC BY SCHOOL'!$D20)),\"\",\"SCH Fees\")","v":""},{"$f":"IF(AND(ISBLANK('Summary-TBC BY SCHOOL'!$D20),ISBLANK('Summary-TBC BY SCHOOL'!$B20)),\"\",IF(ISBLANK('Summary-TBC BY SCHOOL'!$B20),'Summary-TBC BY SCHOOL'!$D20,'Summary-TBC BY SCHOOL'!$B20))","v":""},{"$f":"IF(ISBLANK('Summary-TBC BY SCHOOL'!$C20),\"\",'Summary-TBC BY SCHOOL'!C20)","v":""},{"$f":"IF(AND(ISBLANK('Summary-TBC BY SCHOOL'!$B20),ISBLANK('Summary-TBC BY SCHOOL'!$D20)),\"\",'Summary-TBC BY SCHOOL'!E20)","v":""},"11/07/2022",{"$f":"IFERROR(IF(AND(ISBLANK('Summary-TBC BY SCHOOL'!$D20),ISBLANK('Summary-TBC BY SCHOOL'!$B20)),\"\",'Summary-TBC BY SCHOOL'!$I20*100),\"\")","v":""},{"$f":"IF(ISBLANK('Summary-TBC BY SCHOOL'!$A20),\"\",'Summary-TBC BY SCHOOL'!$A20)","v":""}]
[{"$f":"IF(AND(ISBLANK('Summary-TBC BY SCHOOL'!$B21),ISBLANK('Summary-TBC BY SCHOOL'!$D21)),\"\",\"SCH Fees\")","v":""},{"$f":"IF(AND(ISBLANK('Summary-TBC BY SCHOOL'!$D21),ISBLANK('Summary-TBC BY SCHOOL'!$B21)),\"\",IF(ISBLANK('Summary-TBC BY SCHOOL'!$B21),'Summary-TBC BY SCHOOL'!$D21,'Summary-TBC BY SCHOOL'!$B21))","v":""},{"$f":"IF(ISBLANK('Summary-TBC BY SCHOOL'!$C21),\"\",'Summary-TBC BY SCHOOL'!C21)","v":""},{"$f":"IF(AND(ISBLANK('Summary-TBC BY SCHOOL'!$B21),ISBLANK('Summary-TBC BY SCHOOL'!$D21)),\"\",'Summary-TBC BY SCHOOL'!E21)","v":""},"11/07/2022",{"$f":"IFERROR(IF(AND(ISBLANK('Summary-TBC BY SCHOOL'!$D21),ISBLANK('Summary-TBC BY SCHOOL'!$B21)),\"\",'Summary-TBC BY SCHOOL'!$I21*100),\"\")","v":""},{"$f":"IF(ISBLANK('Summary-TBC BY SCHOOL'!$A21),\"\",'Summary-TBC BY SCHOOL'!$A21)","v":""}]
[{"$f":"IF(AND(ISBLANK('Summary-TBC BY SCHOOL'!$B22),ISBLANK('Summary-TBC BY SCHOOL'!$D22)),\"\",\"SCH Fees\")","v":""},{"$f":"IF(AND(ISBLANK('Summary-TBC BY SCHOOL'!$D22),ISBLANK('Summary-TBC BY SCHOOL'!$B22)),\"\",IF(ISBLANK('Summary-TBC BY SCHOOL'!$B22),'Summary-TBC BY SCHOOL'!$D22,'Summary-TBC BY SCHOOL'!$B22))","v":""},{"$f":"IF(ISBLANK('Summary-TBC BY SCHOOL'!$C22),\"\",'Summary-TBC BY SCHOOL'!C22)","v":""},{"$f":"IF(AND(ISBLANK('Summary-TBC BY SCHOOL'!$B22),ISBLANK('Summary-TBC BY SCHOOL'!$D22)),\"\",'Summary-TBC BY SCHOOL'!E22)","v":""},"11/07/2022",{"$f":"IFERROR(IF(AND(ISBLANK('Summary-TBC BY SCHOOL'!$D22),ISBLANK('Summary-TBC BY SCHOOL'!$B22)),\"\",'Summary-TBC BY SCHOOL'!$I22*100),\"\")","v":""},{"$f":"IF(ISBLANK('Summary-TBC BY SCHOOL'!$A22),\"\",'Summary-TBC BY SCHOOL'!$A22)","v":""}]
[{"$f":"IF(AND(ISBLANK('Summary-TBC BY SCHOOL'!$B23),ISBLANK('Summary-TBC BY SCHOOL'!$D23)),\"\",\"SCH Fees\")","v":""},{"$f":"IF(AND(ISBLANK('Summary-TBC BY SCHOOL'!$D23),ISBLANK('Summary-TBC BY SCHOOL'!$B23)),\"\",IF(ISBLANK('Summary-TBC BY SCHOOL'!$B23),'Summary-TBC BY SCHOOL'!$D23,'Summary-TBC BY SCHOOL'!$B23))","v":""},{"$f":"IF(ISBLANK('Summary-TBC BY SCHOOL'!$C23),\"\",'Summary-TBC BY SCHOOL'!C23)","v":""},{"$f":"IF(AND(ISBLANK('Summary-TBC BY SCHOOL'!$B23),ISBLANK('Summary-TBC BY SCHOOL'!$D23)),\"\",'Summary-TBC BY SCHOOL'!E23)","v":""},"11/07/2022",{"$f":"IFERROR(IF(AND(ISBLANK('Summary-TBC BY SCHOOL'!$D23),ISBLANK('Summary-TBC BY SCHOOL'!$B23)),\"\",'Summary-TBC BY SCHOOL'!$I23*100),\"\")","v":""},{"$f":"IF(ISBLANK('Summary-TBC BY SCHOOL'!$A23),\"\",'Summary-TBC BY SCHOOL'!$A23)","v":""}]
[{"$f":"IF(AND(ISBLANK('Summary-TBC BY SCHOOL'!$B24),ISBLANK('Summary-TBC BY SCHOOL'!$D24)),\"\",\"SCH Fees\")","v":""},{"$f":"IF(AND(ISBLANK('Summary-TBC BY SCHOOL'!$D24),ISBLANK('Summary-TBC BY SCHOOL'!$B24)),\"\",IF(ISBLANK('Summary-TBC BY SCHOOL'!$B24),'Summary-TBC BY SCHOOL'!$D24,'Summary-TBC BY SCHOOL'!$B24))","v":""},{"$f":"IF(ISBLANK('Summary-TBC BY SCHOOL'!$C24),\"\",'Summary-TBC BY SCHOOL'!C24)","v":""},{"$f":"IF(AND(ISBLANK('Summary-TBC BY SCHOOL'!$B24),ISBLANK('Summary-TBC BY SCHOOL'!$D24)),\"\",'Summary-TBC BY SCHOOL'!E24)","v":""},"11/07/2022",{"$f":"IFERROR(IF(AND(ISBLANK('Summary-TBC BY SCHOOL'!$D24),ISBLANK('Summary-TBC BY SCHOOL'!$B24)),\"\",'Summary-TBC BY SCHOOL'!$I24*100),\"\")","v":""},{"$f":"IF(ISBLANK('Summary-TBC BY SCHOOL'!$A24),\"\",'Summary-TBC BY SCHOOL'!$A24)","v":""}]
{"$rows_left_out":132}
{"sheet":"UploadFile","index":4,"n_rows":0,"n_cols":0,"rows_kept":0,"cut":false,"hidden":true,"merged":[]}